{"text_format":"1","workbook":"xlsx","n_sheets":9,"sheets":["Allegion Assesment Instructions","Scoring","Supplier Leadership Questions","Supplier Self Assessment","Allegion OSA","Allegion OSA Scoring","OSA RAIL FOR YELLOW OR RED","Photos (optional)","Revision record"],"not_rendered":{"charts":1,"images":1,"macros":1,"external_links":0,"defined_names":6,"comments":2,"pivot_tables":0},"unopened":[],"bounds":{"document_bytes":16777216,"sheet_cells":100000,"rows_first":2000,"rows_last":500,"rows_between":2000,"halvings":0,"cell_chars":16384,"cell_head_chars":4096},"cells_cut":0,"cells_raw":0,"read":"whole","date_system":"1900"}

{"sheet":"Allegion Assesment Instructions","index":0,"n_rows":39,"n_cols":16,"rows_kept":39,"cut":false,"hidden":false,"merged":[[18,2,18,4],[2,1,3,8],[5,1,6,1],[5,2,6,5],[8,1,9,1],[8,2,9,5],[10,7,10,8],[11,2,11,5],[13,2,13,4],[14,2,14,4],[16,2,16,4],[17,2,17,4],[4,7,4,8],[15,2,15,4],[11,7,11,8],[14,7,14,8],[30,1,30,8],[31,1,31,8],[32,1,32,8],[20,2,20,4],[20,5,20,6],[20,7,20,8],[21,2,21,4],[21,5,21,6],[21,7,21,8],[22,2,22,4],[22,5,22,6],[22,7,22,8],[23,2,23,4],[23,5,23,6],[23,7,23,8],[38,1,38,8],[34,1,34,8],[33,1,33,8],[36,1,36,8],[37,1,37,8]]}
[null,null,null,null,null,null,null,null,null,"a"]
[]
[null,"Supplier Assessment Cover Page and Instructions"]
[]
[null,null,null,null,null,null,null,"Rev. F, January 20, 2022"]
[null,"Supplier Name:  ",null,null,null,null,null,null,null,null,null,null,null,null,null,"Commodity"]
[null,null,null,null,null,null,null,null,null,null,null,null,null,null,null,"BEARINGS"]
[null,null,null,null,null,null,null,null,null,null,null,null,null,null,null,"CASTINGS - DIE"]
[null,"Location:  ",null,null,null,null,null,"Overall Critical Rating","MIN Score",null,null,null,null,null,null,"CASTINGS - INVESTMENT"]
[null,null,null,null,null,null,null,{"$f":"'Allegion OSA'!T12","v":0},{"$f":"MIN('Allegion OSA'!T4:T8)","v":0},null,null,null,null,null,null,"CASTINGS - SAND"]
[null,null,null,null,null,null,null,{"$f":"IF(AND(H10>=0.7,I10>2),\"OSA PASS\",IF(H10>=0.45,\"OSA CONDITIONAL\",IF(H10<0.45,\"OSA FAIL\",\"\")))","v":"OSA FAIL"},null,null,null,null,null,null,null,"ELECTRONICS"]
[null,"Allegion on-site auditor:  ",null,null,null,null,null,{"$f":"IF(AND('Allegion OSA'!AA12>=0.6,'Allegion OSA'!Z12>2),\"EHS PASS\",\"EHS REVIEW\")","v":"EHS REVIEW"},null,null,null,null,null,null,null,"EXTRUSIONS"]
[null,null,null,null,null,null,null,null,null,null,null,null,null,null,null,"FASTENERS"]
[null,null,"Critical Dates",null,null,null,null,"Primary Commodity",null,null,null,null,null,null,null,"FINISHING/POLISHING"]
[null," Supplier Profile Date Received:",null,null,null,null,null,null,null,null,null,null,null,null,null,"FORGINGS"]
{"$rows_left_out":25}
{"sheet":"Scoring","index":1,"n_rows":19,"n_cols":3,"rows_kept":19,"cut":false,"hidden":false,"merged":[[1,1,1,2],[2,1,3,1]]}
[]
[]
[null," EVALUATION SCORING CRITERIA"]
[null,null,"SCORE"]
[null,"Supplier is not familiar with the requirements of the core competency.",0]
[]
[null,"Supplier is knowledgeable of the requirements of the core competency, but has no evidence of source documentation, planning, or implementation",1]
[]
[null,"Supplier is knowledgeable of the requirements, and skilled in the use and implementation of the core competency.  Supplier implementation of the core competency is less than 50% and planning documentation exists for complete (100%) implementation.",2]
[]
[null,"Supplier is knowledgeable of the requirements, and skilled in the use and implementation of the core competency.  Supplier implementation of the core competency is greater than 50% but less than 75%, and planning documentation exists for complete (100%) implementation.",3]
[]
[null,"Supplier is knowledgeable of the requirements, and skilled in the use and implementation of the core competency.  Supplier implementation of the core competency is greater than 75% but less than 100%, and planning documentation exists for continuous improvement.",4]
[]
[null,"Supplier is knowledgeable of the requirements, and proficient in the use and implementation of the core competency.  Supplier implementation of the core competency in typical areas of focus is 100%. Supplier demonstrates innovative use and benefit of the core competency beyond the typical area of focus.",5]
{"$rows_left_out":5}
{"sheet":"Supplier Leadership Questions","index":2,"n_rows":28,"n_cols":7,"rows_kept":28,"cut":false,"hidden":false,"merged":[[0,1,0,10],[4,6,4,10],[5,3,5,5],[5,6,5,10],[6,2,7,2],[6,3,6,5],[6,6,6,10],[7,3,7,5],[7,6,7,10],[4,2,5,2],[4,3,4,5],[12,4,12,10],[9,4,9,10],[23,0,27,0],[23,4,23,10],[24,4,24,10],[25,4,25,10],[27,4,27,10],[12,0,20,0],[1,0,9,0],[8,4,8,10],[2,2,3,2],[2,3,2,5],[2,6,2,10],[3,3,3,5],[3,6,3,10],[20,4,20,10],[26,4,26,10],[19,4,19,10],[13,4,13,10],[14,4,14,10],[17,4,17,10],[15,4,15,10],[18,4,18,10]]}
[null,"Supplier Leadership Questions"]
["Compliance + Emergency Preparedness",null,"Please identify who is responsible for understanding and managing compliance to the following programs:"]
[null,null,"        ∙REACH/RoHS/Prop 65"]
[null,null,null,"Name & Title",null,null,"Email"]
[null,null,"        ∙Conflict Materials"]
[null,null,null,"Name & Title",null,null,"Email"]
[null,null,"        ∙Anti-Human Trafficking/Social Responsibility"]
[null,null,null,"Name & Title",null,null,"Email"]
[null,null,"Does the supplier engage in verification activities of their supplier base to identify, assess and manage risk to human trafficking/forced labor and material regulatory compliance?",null,"Comments:"]
[null,null,"Can the suppler provide a BIP (Business Interruption Plan) that describes their ability to recover from an event - either  naturally caused (e.g. earthquake) or man-made (e.g. explosion) - that causes a lengthy disruption in production?",null,"Comments:"]
[]
[]
["Cybersecurity",null,"Does your company have an Information Technology (IT) department or dedicated personnel (internal or external) focused and actively working on cybersecurity risk?",null,"Please describe the structure of your IT security team here:"]
[null,null,"Does your company have a security awareness program for employees?",null,"Comments:"]
[null,null,"Is there a recovery plan in place for cybersecurity incidents?",null,"If 'Yes', document details of this plan here:  "]
{"$rows_left_out":14}
{"sheet":"Supplier Self Assessment","index":3,"n_rows":119,"n_cols":28,"rows_kept":119,"cut":false,"hidden":false,"merged":[[0,1,0,2],[1,0,16,0],[1,16,2,16],[1,17,1,19],[1,20,1,22],[9,16,11,16],[9,17,9,19],[9,20,9,22],[90,0,100,0],[101,0,111,0],[112,0,118,0],[9,23,9,26],[17,0,43,0],[44,0,48,0],[49,0,60,0],[61,0,79,0],[80,0,89,0]]}
["Process or \nFunction","Question",null,"Procedure Required?","Notes","Score","Quality Management Systems","Commercial Systems","Materials Systems","Engineering Systems","Leadership",null,null,null,null,null,null,null,null,null,null,null,null,null,null,null,null,"Critical or Mature"]
["Receiving Materials","1","Does a formal receiving process exist?","Y",null,"N/A","C",null,null,null,null,null,"Scores","Scores","Critical EHS designation",null,null,"Critical Score",null,null,"Maturity Score",null,null,null,null,null,null,{"$f":"IF(OR(G2=\"C\",H2=\"C\",I2=\"C\",J2=\"C\",K2=\"C\"),\"Critical\",\"Mature\")","v":"Critical"}]
[null,"2","Are purchase orders matched to material received?",null,null,"N/A",null,null,"C",null,null,null,0,0,null,null,null,"Actual","Possible","Min","Actual","Possible","Min",null,null,null,null,{"$f":"IF(OR(G3=\"C\",H3=\"C\",I3=\"C\",J3=\"C\",K3=\"C\"),\"Critical\",\"Mature\")","v":"Critical"}]
[null,"3","Are materials kept in acceptable conditions?",null,null,"N/A",null,null,"C",null,null,null,1,5,null,null,"Quality Management Systems",{"$f":"SUMIF(G2:G119,\"C\",F2:F119)","v":0},{"$f":"SUM(IF(G2:G119=\"C\",IF(ISNUMBER(F2:F119),1,0),0))*5","v":0},{"$f":"MIN(F2,F5,F9,F10,F19,F21,F24,F30,F39,F40,F45,F49,F52,F62,F68)","v":0},{"$f":"SUMIF(G2:G119,\"M\",F2:F119)","v":0},{"$f":"SUM(IF(G2:G119=\"M\",IF(ISNUMBER(F2:F119),1,0),0))*5","v":0},{"$f":"MIN(F6,F7,F8,F11,F12,F20,F22,F23,F29,F36,F37,F46,F55,F63,F65,F66,F67,F71,F72,F73,F76,F77,F78)","v":0}]
[null,"4","Are products identified as acceptable for use with labels or tags?","Y",null,"N/A","C",null,null,null,null,null,2,null,null,null,"Commercial Systems",{"$f":"SUMIF(H2:H119,\"C\",F2:F119)","v":0},{"$f":"SUM(IF(H2:H119=\"C\",IF(ISNUMBER(F2:F119),1,0),0))*5","v":0},{"$f":"MIN(F114)","v":0},{"$f":"SUMIF(H2:H119,\"M\",F2:F119)","v":0},{"$f":"SUM(IF(H2:H119=\"M\",IF(ISNUMBER(F2:F119),1,0),0))*5","v":0},{"$f":"MIN(F25,F33,F117,F118)","v":0},null,null,null,null,{"$f":"IF(OR(G5=\"C\",H5=\"C\",I5=\"C\",J5=\"C\",K5=\"C\"),\"Critical\",\"Mature\")","v":"Critical"}]
[null,"5","Are blue print revision levels verified against PO and shipper?",null,null,"N/A","M",null,null,null,null,null,3,null,null,null,"Materials Systems",{"$f":"SUMIF(I2:I119,\"C\",F2:F119)","v":0},{"$f":"SUM(IF(I2:I119=\"C\",IF(ISNUMBER(F2:F119),1,0),0))*5","v":0},{"$f":"MIN(F3,F4,F18,F26,F27,F50,F51,F103,F105,F109)","v":0},{"$f":"SUMIF(I2:I119,\"M\",F2:F119)","v":0},{"$f":"SUM(IF(I2:I119=\"M\",IF(ISNUMBER(F2:F119),1,0),0))*5","v":0},{"$f":"MIN(F13,F31,F32,F34,F48,F53,F54,F102,F104,F106,F107,F108,F110,F111,F112)","v":0},null,null,null,null,"Mature"]
[null,"6","Is receiving inspection performed?",null,null,"N/A","M",null,null,null,null,null,4,null,null,null,"Engineering Systems",{"$f":"SUMIF(J2:J119,\"C\",F2:F119)","v":0},{"$f":"SUM(IF(J2:J119=\"C\",IF(ISNUMBER(F2:F119),1,0),0))*5","v":0},{"$f":"MIN(F69,F84,F85)","v":0},{"$f":"SUMIF(J2:J119,\"M\",F2:F119)","v":0},{"$f":"SUM(IF(J2:J119=\"M\",IF(ISNUMBER(F2:F119),1,0),0))*5","v":0},{"$f":"MIN(F28,F86,F88)","v":0},null,null,null,null,"Mature"]
[null,"7","If yes, is skip lot or other methods used ?","Y","Document the method","N/A","M",null,null,null,null,null,5,null,null,null,"Leadership",{"$f":"SUMIF(K2:K119,\"C\",F2:F119)","v":0},{"$f":"SUM(IF(K2:K119=\"C\",IF(ISNUMBER(F2:F119),1,0),0))*5","v":5},{"$f":"MIN(F15,F38,F42,F56,F57,F59,F96,F97,F113)","v":0},{"$f":"SUMIF(K2:K119,\"M\",F2:F119)","v":0},{"$f":"SUM(IF(K2:K119=\"M\",IF(ISNUMBER(F2:F119),1,0),0))*5","v":0},{"$f":"MIN(F14,F16,F17,F35,F41,F43,F44,F58,F60,F61,F64,F70,F79,F80,F81,F82,F83,F87,F89,F90,F91,F94,F95,F98,F99,F100,F101,F115,F116,F119)","v":0},null,null,null,null,"Mature"]
[null,"8","Do gages used at R.I. have calibration identified?",null,"Record a gage ID for system confirmation","N/A","C",null,null,null,null,null,"N/A",null,null,null,null,null,null,null,null,null,null,null,null,null,null,"Critical"]
[null,"9","Are records of the inspection kept?",null,"Do results of inspections drive the skip lot process?","N/A","C",null,null,null,null,null,null,null,null,null,"TOTALS","Critical Score",null,null,"Maturity Score",null,null,"EHS Score\n(14, 41, 55, 56, 58, 91, 92, 112, 113)",null,null,null,"Critical"]
[null,"10","Do prints on file at R.I. match current revision levels-internal change control","Y",null,"N/A","M",null,null,null,null,null,null,null,null,null,null,"Actual","Possible","%","Actual","Possible","%","Actual","Possible","Min","%","Mature"]
[null,"11","Is traceability from source maintained?",null,null,"N/A","M",null,null,null,null,null,null,null,null,null,null,{"$f":"SUM(R4:R8)","v":0},{"$f":"S4+S5+S6+S7+S8","v":5},{"$f":"IFERROR(R12/S12,0)","v":0},{"$f":"SUM(U4:U8)","v":0},{"$f":"SUM(V4:V8)","v":0},{"$f":"IFERROR(U12/V12,0)","v":0},{"$f":"SUMIF(O2:O124,\"CE\",F2:F124)","v":0},{"$f":"SUM(IF(O2:O124=\"CE\",IF(ISNUMBER(F2:F124),1,0),0))*5","v":5},{"$f":"MIN(F15,F42,F56,F57,F59,F92,F93,F113,F114)","v":0},{"$f":"IFERROR(X12/Y12,0)","v":0},"Mature"]
[null,"12","The supplier's material flow is designed to support FIFO where applicable. Is it possible to trace back the traceability from finished product to raw material?",null,null,"N/A",null,null,"M",null,null,null,null,null,null,null,null,null,null,null,null,null,null,null,null,null,null,"Mature"]
[null,"13","Obtain name and ID for random operator and job being performed to verify with Training records later.",null,null,"N/A",null,null,null,null,"M",null,null,null,null,null,null,null,null,null,null,null,null,null,null,null,null,"Mature"]
[null,"14","EHS-any PPE needed? Are exits identified? Fire extinguishers?",null,"Is PPE required and is it used Consistently?","N/A",null,null,null,null,"C",null,null,null,"CE",null,null,null,null,null,null,null,null,null,null,null,null,"Critical"]
{"$rows_left_out":105}
{"sheet":"Allegion OSA","index":4,"n_rows":119,"n_cols":28,"rows_kept":119,"cut":false,"hidden":false,"merged":[[0,1,0,2],[9,17,9,19],[9,20,9,22],[9,23,9,26],[1,20,1,22],[1,16,2,16],[112,0,118,0],[1,17,1,19],[49,0,60,0],[80,0,89,0],[90,0,100,0],[101,0,111,0],[61,0,79,0],[1,0,16,0],[17,0,43,0],[44,0,48,0],[9,16,11,16]]}
["Process or \nFunction","Question",null,"Procedure Required?","Notes","Score","Quality Management Systems","Commercial Systems","Materials Systems","Engineering Systems","Leadership",null,null,null,null,null,null,null,null,null,null,null,null,null,null,null,null,"Critical or Mature"]
["Receiving Materials","1","Does a formal receiving process exist?","Y",null,"N/A","C",null,null,null,null,null,"Scores","Scores","Critical EHS designation",null,null,"Critical Score",null,null,"Maturity Score",null,null,null,null,null,null,{"$f":"IF(OR(G2=\"C\",H2=\"C\",I2=\"C\",J2=\"C\",K2=\"C\"),\"Critical\",\"Mature\")","v":"Critical"}]
[null,"2","Are purchase orders matched to material received?",null,null,"N/A",null,null,"C",null,null,null,0,0,null,null,null,"Actual","Possible","Min","Actual","Possible","Min",null,null,null,null,{"$f":"IF(OR(G3=\"C\",H3=\"C\",I3=\"C\",J3=\"C\",K3=\"C\"),\"Critical\",\"Mature\")","v":"Critical"}]
[null,"3","Are materials kept in acceptable conditions?",null,null,"N/A",null,null,"C",null,null,null,1,5,null,null,"Quality Management Systems",{"$f":"SUMIF(G2:G119,\"C\",F2:F119)","v":0},{"$f":"SUM(IF(G2:G119=\"C\",IF(ISNUMBER(F2:F119),1,0),0))*5","v":0},{"$f":"MIN(F2,F5,F9,F10,F19,F21,F24,F30,F39,F40,F45,F49,F52,F62,F68)","v":0},{"$f":"SUMIF(G2:G119,\"M\",F2:F119)","v":0},{"$f":"SUM(IF(G2:G119=\"M\",IF(ISNUMBER(F2:F119),1,0),0))*5","v":0},{"$f":"MIN(F6,F7,F8,F11,F12,F20,F22,F23,F29,F36,F37,F46,F55,F63,F65,F66,F67,F71,F72,F73,F76,F77,F78)","v":0}]
[null,"4","Are products identified as acceptable for use with labels or tags?","Y",null,"N/A","C",null,null,null,null,null,2,"N/A",null,null,"Commercial Systems",{"$f":"SUMIF(H2:H119,\"C\",F2:F119)","v":0},{"$f":"SUM(IF(H2:H119=\"C\",IF(ISNUMBER(F2:F119),1,0),0))*5","v":0},{"$f":"MIN(F114)","v":0},{"$f":"SUMIF(H2:H119,\"M\",F2:F119)","v":0},{"$f":"SUM(IF(H2:H119=\"M\",IF(ISNUMBER(F2:F119),1,0),0))*5","v":0},{"$f":"MIN(F25,F33,F117,F118)","v":0},null,null,null,null,"Critical"]
[null,"5","Are blue print revision levels verified against PO and shipper?",null,null,"N/A","M",null,null,null,null,null,3,null,null,null,"Materials Systems",{"$f":"SUMIF(I2:I119,\"C\",F2:F119)","v":0},{"$f":"SUM(IF(I2:I119=\"C\",IF(ISNUMBER(F2:F119),1,0),0))*5","v":0},{"$f":"MIN(F3,F4,F18,F26,F27,F50,F51,F103,F105,F109)","v":0},{"$f":"SUMIF(I2:I119,\"M\",F2:F119)","v":0},{"$f":"SUM(IF(I2:I119=\"M\",IF(ISNUMBER(F2:F119),1,0),0))*5","v":0},{"$f":"MIN(F13,F31,F32,F34,F48,F53,F54,F102,F104,F106,F107,F108,F110,F111,F112)","v":0},null,null,null,null,"Mature"]
[null,"6","Is receiving inspection performed?",null,null,"N/A","M",null,null,null,null,null,4,null,null,null,"Engineering Systems",{"$f":"SUMIF(J2:J119,\"C\",F2:F119)","v":0},{"$f":"SUM(IF(J2:J119=\"C\",IF(ISNUMBER(F2:F119),1,0),0))*5","v":0},{"$f":"MIN(F69,F84,F85)","v":0},{"$f":"SUMIF(J2:J119,\"M\",F2:F119)","v":0},{"$f":"SUM(IF(J2:J119=\"M\",IF(ISNUMBER(F2:F119),1,0),0))*5","v":0},{"$f":"MIN(F28,F86,F88)","v":0},null,null,null,null,"Mature"]
[null,"7","If yes, is skip lot or other methods used ?","Y","Document the method","N/A","M",null,null,null,null,null,5,null,null,null,"Leadership",{"$f":"SUMIF(K2:K119,\"C\",F2:F119)","v":0},{"$f":"SUM(IF(K2:K119=\"C\",IF(ISNUMBER(F2:F119),1,0),0))*5","v":5},{"$f":"MIN(F15,F38,F42,F56,F57,F59,F96,F97,F113)","v":0},{"$f":"SUMIF(K2:K119,\"M\",F2:F119)","v":0},{"$f":"SUM(IF(K2:K119=\"M\",IF(ISNUMBER(F2:F119),1,0),0))*5","v":0},{"$f":"MIN(F14,F16,F17,F35,F41,F43,F44,F58,F60,F61,F64,F70,F79,F80,F81,F82,F83,F87,F89,F90,F91,F94,F95,F98,F99,F100,F101,F115,F116,F119)","v":0},null,null,null,null,"Mature"]
[null,"8","Do gages used at R.I. have calibration identified?",null,"Record a gage ID for system confirmation","N/A","C",null,null,null,null,null,"N/A",null,null,null,null,null,null,null,null,null,null,null,null,null,null,"Critical"]
[null,"9","Are records of the inspection kept?",null,"Do results of inspections drive the skip lot process?","N/A","C",null,null,null,null,null,null,null,null,null,"TOTALS","Critical Score",null,null,"Maturity Score",null,null,"EHS Score\n(14, 41, 55, 56, 58, 91, 92, 112, 113)",null,null,null,"Critical"]
[null,"10","Do prints on file at R.I. match current revision levels-internal change control","Y",null,"N/A","M",null,null,null,null,null,null,null,null,null,null,"Actual","Possible","%","Actual","Possible","%","Actual","Possible","Min","%","Mature"]
[null,"11","Is traceability from source maintained?",null,null,"N/A","M",null,null,null,null,null,null,null,null,null,null,{"$f":"SUM(R4:R8)","v":0},{"$f":"S4+S5+S6+S7+S8","v":5},{"$f":"IFERROR(R12/S12,0)","v":0},{"$f":"SUM(U4:U8)","v":0},{"$f":"SUM(V4:V8)","v":0},{"$f":"IFERROR(U12/V12,0)","v":0},{"$f":"SUMIF(O2:O124,\"CE\",F2:F124)","v":0},{"$f":"SUM(IF(O2:O124=\"CE\",IF(ISNUMBER(F2:F124),1,0),0))*5","v":5},{"$f":"MIN(F15,F42,F56,F57,F59,F92,F93,F113,F114)","v":0},{"$f":"IFERROR(X12/Y12,0)","v":0},"Mature"]
[null,"12","The supplier's material flow is designed to support FIFO where applicable. Is it possible to trace back the traceability from finished product to raw material?",null,null,"N/A",null,null,"M",null,null,null,null,null,null,null,null,null,null,null,null,null,null,null,null,null,null,"Mature"]
[null,"13","Obtain name and ID for random operator and job being performed to verify with Training records later.",null,null,"N/A",null,null,null,null,"M",null,null,null,null,null,null,null,null,null,null,null,null,null,null,null,null,"Mature"]
[null,"14","EHS-any PPE needed? Are exits identified? Fire extinguishers?",null,"Is PPE required and is it used Consistently?","N/A",null,null,null,null,"C",null,null,null,"CE",null,null,null,null,null,null,null,null,null,null,null,null,"Critical"]
{"$rows_left_out":105}
{"sheet":"Allegion OSA Scoring","index":5,"n_rows":8,"n_cols":11,"rows_kept":8,"cut":false,"hidden":false,"merged":[[1,1,1,8]]}
[]
[null,"Allegion Audit Scores",null,null,null,null,null,null,null,"Critical Score","Maturity Score"]
[null,"A.","Quality Management Systems",null,null,null,null,null,null,{"$f":"IFERROR('Allegion OSA'!R4/'Allegion OSA'!S4,0)","v":0},{"$f":"IFERROR('Allegion OSA'!U4/'Allegion OSA'!V4,0)","v":0}]
[null,"B.","Commercial Systems",null,null,null,null,null,null,{"$f":"IFERROR('Allegion OSA'!R5/'Allegion OSA'!S5,0)","v":0},{"$f":"IFERROR('Allegion OSA'!U5/'Allegion OSA'!V5,0)","v":0}]
[null,"C.","Materials Systems",null,null,null,null,null,null,{"$f":"IFERROR('Allegion OSA'!R6/'Allegion OSA'!S6,0)","v":0},{"$f":"IFERROR('Allegion OSA'!U6/'Allegion OSA'!V6,0)","v":0}]
[null,"D.","Engineering Systems",null,null,null,null,null,null,{"$f":"IFERROR('Allegion OSA'!R7/'Allegion OSA'!S7,0)","v":0},{"$f":"IFERROR('Allegion OSA'!U7/'Allegion OSA'!V7,0)","v":0}]
[null,"E.","Leadership",null,null,null,null,null,null,{"$f":"IFERROR('Allegion OSA'!R8/'Allegion OSA'!S8,0)","v":0},{"$f":"IFERROR('Allegion OSA'!U8/'Allegion OSA'!V8,0)","v":0}]
[null,null,"OVERALL LOWEST SCORE",null,null,null,null,null,null,{"$f":"IFERROR('Allegion OSA'!R12/'Allegion OSA'!S12,0)","v":0},{"$f":"IFERROR('Allegion OSA'!U12/'Allegion OSA'!V12,0)","v":0}]

{"sheet":"OSA RAIL FOR YELLOW OR RED","index":6,"n_rows":123,"n_cols":12,"rows_kept":123,"cut":false,"hidden":false,"merged":[[0,5,1,5]]}
[null,null,null,null,null,"RAIL"]
[]
[null,null,null,null,null,"Rolling Action Item List"]
[null,null,null,null,null,null,null,null,null,"Revision Date: ",null,{"$f":"'Allegion Assesment Instructions'!I5","v":"00:00:00"}]
["Item #","Functional Area","Question","Score","Maturity","Action","Date Assigned","Responsible Person","Date Due","Date Completed","Status","Status & Comments"]
[1,"Receiving","Does a formal receiving process exist?",{"$f":"'Allegion OSA'!$F2","v":"N/A"},{"$f":"'Allegion OSA'!$G2","v":"C"},null,null,null,null,null,"G"]
[2,"Receiving","Are purchase orders matched to material received?",{"$f":"'Allegion OSA'!$F3","v":"N/A"},{"$f":"'Allegion OSA'!I3","v":"C"},null,null,null,null,null,"G"]
[3,"Receiving","Are materials kept in acceptable conditions?",{"$f":"'Allegion OSA'!$F4","v":"N/A"},{"$f":"'Allegion OSA'!I4","v":"C"},null,null,null,null,null,"G"]
[4,"Receiving","Are products identified as acceptable for use with labels or tags?",{"$f":"'Allegion OSA'!$F5","v":"N/A"},{"$f":"'Allegion OSA'!$G5","v":"C"},null,null,null,null,null,"G"]
[5,"Receiving","Are blue print revision levels verified against PO and shipper?",{"$f":"'Allegion OSA'!$F6","v":"N/A"},{"$f":"'Allegion OSA'!$G6","v":"M"},null,null,null,null,null,"G"]
[6,"Receiving","Is receiving inspection performed?",{"$f":"'Allegion OSA'!$F7","v":"N/A"},{"$f":"'Allegion OSA'!$G7","v":"M"},null,null,null,null,null,"G"]
[7,"Receiving","If yes, is skip lot or other methods used ?",{"$f":"'Allegion OSA'!$F8","v":"N/A"},{"$f":"'Allegion OSA'!$G8","v":"M"},null,null,null,null,null,"G"]
[8,"Receiving","Do gages used at R.I. have calibration identified?",{"$f":"'Allegion OSA'!$F9","v":"N/A"},{"$f":"'Allegion OSA'!$G9","v":"C"},null,null,null,null,null,"G"]
[9,"Receiving","Are records of the inspection kept?",{"$f":"'Allegion OSA'!$F10","v":"N/A"},{"$f":"'Allegion OSA'!$G10","v":"C"},null,null,null,null,null,"G"]
[10,"Receiving","Do prints on file at R.I. match current revision levels-internal change control",{"$f":"'Allegion OSA'!$F11","v":"N/A"},{"$f":"'Allegion OSA'!$G11","v":"M"},null,null,null,null,null,"G"]
{"$rows_left_out":109}
{"sheet":"Photos (optional)","index":7,"n_rows":0,"n_cols":0,"rows_kept":0,"cut":false,"hidden":false,"merged":[]}

{"sheet":"Revision record","index":8,"n_rows":10,"n_cols":4,"rows_kept":10,"cut":false,"hidden":false,"merged":[]}
[null,"Revision History:"]
[]
[null,"Revision","Date","Description of Change"]
[null,2.2999999999999998,"2017-03-31","Scoring formula updated"]
[null,3,"2017-10-01","complete revision to format, some questions modified/deleted/added"]
[null,"B","2017-12-18","Added Supplier Development and Trade Compliance sections"]
[null,"C","2020-11-30","Changed Trade Compliance to C-TPAT, added Critical / Mature slicer"]
[null,"D","2021-11-02","Created tab specifically for supplier self assessment, as well as tab specifically for leadership questions.  Removed these leadership questions from Allegion OSA Questions tab"]
[null,"E","2021-12-20","Broke out CTPAT section and Supplier Development sections from bottom of 'Allegion OSA' tab and created new tab for 'Supplier Leadership Question'\n- also added Cybersecurity questions to this new tab\n- updated wording in each of the CTPAT questions\n\nCreated new tab specifically for supplier self assessment so we can store their self assessment and our OSA results together\n\nAdded pass / fail criteria description to Allegion Assessment Instructions tab\nUpdated description of 'Overall Rating' on this tab to 'Overall Critical Rating' as well\n\nUpdated instructions to reflect changes listed above\n\nAdded EHS 'rating' to draw attention to specific safety related questions - these are noted in the OSA itself\n\nChanged 9 questions from 'mature' to 'critical' to reflect ALLE's growth in supplier maturity\n(19, 21, 54, 65, 70, 71, 72, 90, 114)\nMade Q112 only able to be scored a 0 or 5\nChanged wording in Q39 from Allegion owned tooling to \"customer and / or Allegion owned\"\n\nDeleted 'notes' tab"]
[null,"F","2022-01-20","Corrections to Mature and Critical questions referenced in Rev E"]